Target
Histone deacetylase 2
Ligand
BDBM222230
Substrate
Meas. Tech.
HDAC2 Enzyme Assay
IC50
>3.0e+4±n/a nM
Citation
 Huong, TTDung, DTHuan, NVCuong, LVHai, PTHuong, LTKim, JKim, YGHan, SBNam, NH Novel N-hydroxybenzamides incorporating 2-oxoindoline with unexpected potent histone deacetylase inhibitory effects and antitumor cytotoxicity. Bioorg Chem 71:160-169 (2017)  
Target
Name:
Histone deacetylase 2
Synonyms:
Cereblon/Histone deacetylase 2 HDAC2 Histone deacetylase 2 (HDAC2) | Human HDAC2
Type:
Chromatin regulator; hydrolase; repressor
Mol. Mass.:
55356.54
Organism:
Homo sapiens (Human)
Description:
Q92769
Residue:
488
  
Inhibitor
Name:
BDBM222230
Synonyms:
N-Hydroxy-4-((3-(hydroxyimino)-2-oxoindolin-1-yl)methyl)benzamide (6a)
Type:
Small organic molecule
Emp. Form.:
C16H13N3O4
Mol. Mass.:
311.2921
SMILES:
ONC(=O)c1ccc(CN2C(=O)\C(=N/O)c3ccccc23)cc1
: