Target
Intestinal-type alkaline phosphatase
Ligand
BDBM222262
Substrate
Meas. Tech.
Alkaline Phosphatase Assay
pH
9.8±n/a
Temperature
310.15±n/a K
IC50
3.5e+2± 2e+1 nM
Comments
extracted
Citation
 Ejaz, SASaeed, ASiddique, MNNisa, ZUKhan, SLecka, JSévigny, JIqbal, J Synthesis, characterization and biological evaluation of novel chalcone sulfonamide hybrids as potent intestinal alkaline phosphatase inhibitors. Bioorg Chem 70:229-236 (2017)  
Target
Name:
Intestinal-type alkaline phosphatase
Synonyms:
ALPI Intestinal alkaline phosphatase (IAP) PPBI_BOVIN
Type:
Protein
Mol. Mass.:
57094.82
Organism:
Bos taurus (Cattle)
Description:
P19111
Residue:
533
  
Inhibitor
Name:
BDBM222262
Synonyms:
(Z)-4-(2-((E)-4-(3,4-dimethoxyphenyl)-1-morpholino-2-oxobut-3-enylidene) hydrazinyl) benzenesulfonamide (4e)
Type:
Small organic molecule
Emp. Form.:
C22H26N4O6S
Mol. Mass.:
474.53
SMILES:
COc1ccc(\C=C\C(=O)C(=N\Nc2ccc(cc2)S(N)(=O)=O)\N2CCOCC2)cc1OC
: