Target
Alpha-glucosidase MAL32
Ligand
BDBM222412
Substrate
Meas. Tech.
α-Glucosidase Inhibition Assay
pH
6.8±n/a
Temperature
274.15±n/a K
IC50
1.2133e+5± 5.2e+3 nM
Comments
extracted
Citation
 Gupta, SJDutta, SGajbhiye, RLJaisankar, PSen, AK Synthesis, in vitro evaluation and molecular docking studies of novel amide linked triazolyl glycoconjugates as new inhibitors of a-glucosidase. Bioorg Chem 72:11-20 (2017)  
Target
Name:
Alpha-glucosidase MAL32
Synonyms:
Alpha-glucosidase MAL32 MAL32_YEAST Maltase alpha-Glucosidase (alpha-Glu) | alpha-Glucosidase (α-Glucosidase)
Type:
Hydrolase
Mol. Mass.:
68132.36
Organism:
Saccharomyces cerevisiae
Description:
Purchased from Wako Fine Chemicals Co. Ltd.
Residue:
584
  
Inhibitor
Name:
BDBM222412
Synonyms:
3-[1-(3,4, 5-trimethoxyphenyl)-1H-[1,2,3]triazol-4-yl]-N-(2,3,4,6-tetra-O-acetyl-β-D-glucopyranosyl)propanamide (4l)
Type:
Small organic molecule
Emp. Form.:
C20H28N4O9
Mol. Mass.:
468.4577
SMILES:
COc1cc(cc(OC)c1OC)-n1cc(CCC(=O)N[C@@H]2OC(CO)[C@@H](O)C(O)C2O)nn1
: