Target
Guanine nucleotide-binding protein subunit alpha-15/Metabotropic glutamate receptor 2
Ligand
BDBM222979
Substrate
Meas. Tech.
Fluorescence Laser Imaging Plate Reader (FLIPR) Based Assay
EC50
123.3±n/a nM
Citation
 Fiji, HDKelly, III, MJKern, JCLayton, MEPero, JEReif, AJRossi, MA Imidazopyridin-2-one derivatives US Patent  US9315518 Publication Date 4/19/2016 
Target
Name:
Guanine nucleotide-binding protein subunit alpha-15/Metabotropic glutamate receptor 2
Synonyms:
mGluR2 and G alpha 16
Type:
Protein
Mol. Mass.:
Description:
Components:
This complex has 2 components.
Component 1
Name:
Metabotropic glutamate receptor 2
Synonyms:
GPRC1B GRM2_HUMAN Metabotropic glutamate receptor mGlu2 | metabotropic glutamate 2
Type:
Enzyme
Mol. Mass.:
95584.88
Organism:
Homo sapiens (Human)
Description:
Q14416
Residue:
872
  
Component 2
Name:
Guanine nucleotide-binding protein subunit alpha-15
Synonyms:
G-protein subunit alpha-16 GNA15 GNA16 | guanine nucleotide-binding protein subunit alpha-15
Type:
Protein
Mol. Mass.:
43577.62
Organism:
Homo sapiens (Human)
Description:
P30679
Residue:
374
  
Inhibitor
Name:
BDBM222979
Synonyms:
US9315518, 14-6
Type:
Small organic molecule
Emp. Form.:
C22H21F2N5O3
Mol. Mass.:
441.4306
SMILES:
Cn1c2nc(ccc2n(CC2CC2(F)F)c1=O)C1=CC2CN(CC2C1)C(=O)c1ncco1
: