Target
Proto-oncogene tyrosine-protein kinase Src
Ligand
BDBM6181
Substrate
Poly(E:Y)
Meas. Tech.
Kinase Inhibition Assay
IC50
>50000±n/a nM
Citation
 Thompson, AMDelaney, AMHamby, JMSchroeder, MCSpoon, TACrean, SMShowalter, HDDenny, WA Synthesis and structure-activity relationships of soluble 7-substituted 3-(3,5-dimethoxyphenyl)-1,6-naphthyridin-2-amines and related ureas as dual inhibitors of the fibroblast growth factor receptor-1 and vascular endothelial growth factor receptor-2 tyrosine kinases. J Med Chem 48:4628-53 (2005)  
Target
Name:
Proto-oncogene tyrosine-protein kinase Src
Synonyms:
Calmodulin/Proto-oncogene tyrosine-protein kinase Src Proto-oncogene c-Src SRC SRC_HUMAN V-src sarcoma (Schmidt-Ruppin A-2) viral oncogene homolog (avian) p60-Src | pp60c-src
Type:
Protein
Mol. Mass.:
59838.60
Organism:
Homo sapiens (Human)
Description:
P12931
Residue:
536
  
Inhibitor
Name:
BDBM6181
Synonyms:
3,4-Dihydro-1,6-naphthyridine analogue 48 N-[3-(benzyloxy)propyl]-N-{2-[(tert-butylcarbamoyl)amino]-3-(3,5-dimethoxyphenyl)-3,4-dihydro-1,6-naphthyridin-7-yl}acetamide
Type:
Small organic molecule
Emp. Form.:
C33H41N5O5
Mol. Mass.:
587.7091
SMILES:
COc1cc(OC)cc(c1)C1Cc2cnc(cc2N=C1NC(=O)NC(C)(C)C)N(CCCOCc1ccccc1)C(C)=O
:
Substrate
Name:
Poly(E:Y)
Synonyms:
Type:
Random polymer
Mol. Mass.:
358.43
Organism:
Description:
Random copolymer of glutamic acid and tyrosine (4:1).
Residue:
3
NA