Target
Dipeptidyl peptidase 3
Ligand
BDBM7457
Substrate
Meas. Tech.
DPP III Enzyme Activity Assay
pH
7.4±0
Temperature
310.15±0 K
IC50
2.49e+4± 2e+3 nM
Citation
 Agic, DBrkic, HTomic, SKaracic, Z?poljarevic, MLisjak, MBe?lo, DAbramic, M Validation of flavonoids as potential dipeptidyl peptidase III inhibitors: Experimental and computational approach. Chem Biol Drug Des 89:619-627 (2017)  
Target
Name:
Dipeptidyl peptidase 3
Synonyms:
DPP3 Dipeptidyl arylamidase III Dipeptidyl peptidase III | Dipeptidyl peptidase III (DPP III)
Type:
Enzyme
Mol. Mass.:
82565.94
Organism:
Homo sapiens (Human)
Description:
Q9NY33
Residue:
737
  
Inhibitor
Name:
BDBM7457
Synonyms:
2-(3,4-dihydroxyphenyl)-3,7-dihydroxy-4H-chromen-4-one 2-(3,4-dihydroxyphenyl)-3,7-dihydroxy-chromone;dihydrate Fisetin (14) fisetin
Type:
Small organic molecule
Emp. Form.:
C15H10O6
Mol. Mass.:
286.2363
SMILES:
Oc1ccc2c(c1)oc(-c1ccc(O)c(O)c1)c(O)c2=O
: