Target
Aldehyde dehydrogenase, dimeric NADP-preferring
Ligand
BDBM62169
Substrate
Meas. Tech.
Inhibiton Assay
pH
7.5±n/a
IC50
50000±n/a nM
Comments
extracted
Citation
 Hurley, TD Regulators of aldehyde dehydrogenase ALDH3A1 and related therapeutic methods US Patent  US9320722 Publication Date 4/26/2016 
Target
Name:
Aldehyde dehydrogenase, dimeric NADP-preferring
Synonyms:
AL3A1_HUMAN ALDH3A1 Aldehyde dehydrogenase family 3 member A1 (ALDH3A1) | Aldehyde dehydrogenase family 3 member A1 (ALDH3A1) (Q122A)
Type:
Protein
Mol. Mass.:
50394.38
Organism:
Homo sapiens (Human)
Description:
Residue:
453
  
Inhibitor
Name:
BDBM62169
Synonyms:
1-(4-methylphenyl)sulfonylbenzimidazole MLS-0082307.0001 cid_746711
Type:
Small organic molecule
Emp. Form.:
C14H12N2O2S
Mol. Mass.:
272.322
SMILES:
Cc1ccc(cc1)S(=O)(=O)n1cnc2ccccc12
: