Target
Aldehyde dehydrogenase 1A1
Ligand
BDBM109224
Substrate
BDBM60952
Meas. Tech.
Inhibiton Assay
pH
7.5±n/a
IC50
8300±3000 nM
Comments
extracted
Citation
 Hurley, TD Regulators of aldehyde dehydrogenase ALDH3A1 and related therapeutic methods US Patent  US9320722 Publication Date 4/26/2016 
Target
Name:
Aldehyde dehydrogenase 1A1
Synonyms:
AL1A1_HUMAN ALDH-E1 ALDH1A1 Aldehyde dehydrogenase 1A1 (ALDH1A1) Aldehyde dehydrogenase family 1 member A1 (ALDH1A1) PUMB1 RalDH1 | Retinal dehydrogenase 1
Type:
Protein
Mol. Mass.:
54862.21
Organism:
Homo sapiens (Human)
Description:
Residue:
501
  
Inhibitor
Name:
BDBM109224
Synonyms:
CB29 (derivative 14) | US9320722, 14
Type:
Small organic molecule
Emp. Form.:
C20H26N4O5S
Mol. Mass.:
434.509
SMILES:
CCN(CC)S(=O)(=O)c1ccc(Nc2ccc(NC(=O)C(C)C)cc2)c(c1)[N+]([O-])=O
:
Substrate
Name:
BDBM60952
Synonyms:
propionaldehyde
Type:
Emp. Form.:
C3H6O
Mol. Mass.:
58.0791
SMILES:
CCC=O
: