Target
Aldehyde dehydrogenase, dimeric NADP-preferring
Ligand
BDBM223453
Substrate
BDBM60953
Meas. Tech.
Inhibiton Assay
pH
7.5±n/a
IC50
26900±6000 nM
Comments
extracted
Citation
 Hurley, TD Regulators of aldehyde dehydrogenase ALDH3A1 and related therapeutic methods US Patent  US9320722 Publication Date 4/26/2016 
Target
Name:
Aldehyde dehydrogenase, dimeric NADP-preferring
Synonyms:
AL3A1_HUMAN ALDH3A1 Aldehyde dehydrogenase family 3 member A1 (ALDH3A1) | Aldehyde dehydrogenase family 3 member A1 (ALDH3A1) (Q122A)
Type:
Protein
Mol. Mass.:
50394.38
Organism:
Homo sapiens (Human)
Description:
Residue:
453
  
Inhibitor
Name:
BDBM223453
Synonyms:
US9320722, 17
Type:
Small organic molecule
Emp. Form.:
C16H17N2O4S
Mol. Mass.:
333.382
SMILES:
CS(=O)(=O)c1ccc(Nc2ccc3CCCc3c2)c(c1)[N+](O)=O
:
Substrate
Name:
BDBM60953
Synonyms:
BDBM50139371 | benzaldehyde
Type:
Emp. Form.:
C7H6O
Mol. Mass.:
106.1219
SMILES:
O=Cc1ccccc1
: