Target
Aldehyde dehydrogenase 1A1
Ligand
BDBM223460
Substrate
BDBM60952
Meas. Tech.
Inhibiton Assay
pH
7.5±n/a
IC50
800±n/a nM
Comments
extracted
Citation
 Hurley, TD Regulators of aldehyde dehydrogenase ALDH3A1 and related therapeutic methods US Patent  US9320722 Publication Date 4/26/2016 
Target
Name:
Aldehyde dehydrogenase 1A1
Synonyms:
AL1A1_HUMAN ALDH-E1 ALDH1A1 Aldehyde dehydrogenase 1A1 (ALDH1A1) Aldehyde dehydrogenase family 1 member A1 (ALDH1A1) PUMB1 RalDH1 | Retinal dehydrogenase 1
Type:
Protein
Mol. Mass.:
54862.21
Organism:
Homo sapiens (Human)
Description:
Residue:
501
  
Inhibitor
Name:
BDBM223460
Synonyms:
US9320722, CD8
Type:
Small organic molecule
Emp. Form.:
C19H18N2O5
Mol. Mass.:
354.3566
SMILES:
CCOC(=O)CN1C(=O)C(O)(CC(=O)c2ccncc2)c2ccccc12
:
Substrate
Name:
BDBM60952
Synonyms:
propionaldehyde
Type:
Emp. Form.:
C3H6O
Mol. Mass.:
58.0791
SMILES:
CCC=O
: