Target
Lysophosphatidic acid receptor 1
Ligand
BDBM50398096
Substrate
Meas. Tech.
Calcium Flux Assay Using Fluorometric Imaging Plate Reader (FLIPR) Assay
Temperature
298.15±n/a K
IC50
48±n/a nM
Comments
extracted
Citation
 Gabriel, SDHamilton, MMLucas, MCQian, YSidduri, A N-alkyltriazole compounds as LPAR antagonists US Patent  US9321738 Publication Date 4/26/2016 
Target
Name:
Lysophosphatidic acid receptor 1
Synonyms:
EDG2 LPA-1 LPAR1 Lysophosphatidic acid receptor 1 (LPA1) | Lysophosphatidic acid receptor Edg-2
Type:
Enzyme
Mol. Mass.:
41120.55
Organism:
Homo sapiens (Human)
Description:
Q92633
Residue:
364
  
Inhibitor
Name:
BDBM50398096
Synonyms:
CHEMBL2182042 | US9321738, 3
Type:
Small organic molecule
Emp. Form.:
C26H24N4O4
Mol. Mass.:
456.4932
SMILES:
C[C@@H](OC(=O)Nc1c(nnn1C)-c1ccc(cc1)-c1ccc(CC(O)=O)cc1)c1ccccc1
: