Target
Beta-secretase 1
Ligand
BDBM291134
Substrate
Meas. Tech.
HTRF FRET Assay
pH
5±n/a
Ki
58.0±n/a nM
Comments
extracted
Citation
 Cumming, JNScott, Jr., JDStamford, AWIserloh, UNeelamkavil, SFShao, PPWilson, JE C6-spiro iminothiadiazine dioxides as BACE inhibitors, compositions, and their use US Patent  US9580396 Publication Date 2/28/2017 
Target
Name:
Beta-secretase 1
Synonyms:
ASP2 Aspartyl protease 2 BACE1 Beta-secretase (BACE) Beta-secretase 1 (BACE 1) Beta-secretase 1 (BACE1) Beta-site amyloid precursor protein cleaving enzyme 1 Memapsin-2 beta-Secretase (BACE-1) | beta-Secretase (BACE1)
Type:
Protein
Mol. Mass.:
55755.10
Organism:
Homo sapiens (Human)
Description:
P56817
Residue:
501
  
Inhibitor
Name:
BDBM291134
Synonyms:
US9580396, Example 4a
Type:
Small organic molecule
Emp. Form.:
C19H20ClN5O3S
Mol. Mass.:
433.912
SMILES:
CN1C(=N)N[C@@]2(CCCc3ccc(NC(=O)c4ccc(Cl)cn4)cc23)CS1(=O)=O
: