Target
DNA helicase [35-727]
Ligand
BDBM200295
Substrate
Meas. Tech.
DNA-Dependent ATPase Assay
pH
8±0
Temperature
310.15±0 K
IC50
3.1e+3±n/a nM
Citation
 Tarique, MTabassum, FAhmad, MTuteja, R Plasmodium falciparum UvrD activities are downregulated by DNA-interacting compounds and its dsRNA inhibits malaria parasite growth. BMC Biochem 15:9 (2014)  
Target
Name:
DNA helicase [35-727]
Synonyms:
UvrD helicase (PfUDN)
Type:
Enzyme
Mol. Mass.:
81959.48
Organism:
Plasmodium falciparum
Description:
N-terminal fragment of P. falciparum UvrD helicase (35-727 aa)
Residue:
693
  
Inhibitor
Name:
BDBM200295
Synonyms:
AB00053825_07 cid_3624
Type:
Small organic molecule
Emp. Form.:
C21H20N3
Mol. Mass.:
314.4031
SMILES:
CC[n+]1c(-c2ccccc2)c2cc(N)ccc2c2ccc(N)cc12
: