Target
Histone-binding protein RBBP4/Histone-lysine N-methyltransferase EZH1/Polycomb protein EED/Polycomb protein SUZ12/Zinc finger protein AEBP2
Ligand
BDBM225230
Substrate
Meas. Tech.
HMT Assay
IC50
5e+1±n/a nM
Citation
 Qi, WZhao, KGu, JHuang, YWang, YZhang, HZhang, MZhang, JYu, ZLi, LTeng, LChuai, SZhang, CZhao, MChan, HChen, ZFang, DFei, QFeng, LFeng, LGao, YGe, HGe, XLi, GLingel, ALin, YLiu, YLuo, FShi, MWang, LWang, ZYu, YZeng, JZeng, CZhang, LZhang, QZhou, SOyang, CAtadja, PLi, E An allosteric PRC2 inhibitor targeting the H3K27me3 binding pocket of EED. Nat Chem Biol 13:381-388 (2017)  
Target
Name:
Histone-binding protein RBBP4/Histone-lysine N-methyltransferase EZH1/Polycomb protein EED/Polycomb protein SUZ12/Zinc finger protein AEBP2
Synonyms:
EZH1/PRC2 | EZH1/SUZ12/EED/AEBP2/RBBP4 complex
Type:
Protein
Mol. Mass.:
Description:
Components:
This complex has 5 components.
Component 1
Name:
Histone-lysine N-methyltransferase EZH1
Synonyms:
ENX-2 EZH1_HUMAN Enhancer of zeste homolog 1 (EZH1) KIAA0388
Type:
Protein
Mol. Mass.:
85285.34
Organism:
Homo sapiens (Human)
Description:
Q92800
Residue:
747
  
Component 2
Name:
Polycomb protein SUZ12
Synonyms:
CHET9 Chromatin precipitated E2F target 9 protein Joined to JAZF1 protein Polycomb protein SUZ12 SUZ12 Suppressor of zeste 12 protein homolog
Type:
Protein
Mol. Mass.:
83080.09
Organism:
Homo sapiens (Human)
Description:
Q15022
Residue:
739
  
Component 3
Name:
Polycomb protein EED
Synonyms:
EED WAIT-1 hEED
Type:
Protein
Mol. Mass.:
50201.68
Organism:
Homo sapiens (Human)
Description:
O75530
Residue:
441
  
Component 4
Name:
Zinc finger protein AEBP2
Synonyms:
AEBP2 Adipocyte enhancer-binding protein 2 (AEBP2) | Zinc finger protein AEBP2
Type:
Protein
Mol. Mass.:
54448.84
Organism:
Homo sapiens (Human)
Description:
Q6ZN18
Residue:
517
  
Component 5
Name:
Histone-binding protein RBBP4
Synonyms:
RBAP48 RBBP4_HUMAN | Retinoblastoma-binding protein p48 (RBAP48)
Type:
Protein
Mol. Mass.:
47627.91
Organism:
Homo sapiens (Human)
Description:
Q09028
Residue:
425
  
Inhibitor
Name:
BDBM225230
Synonyms:
EED226 | US11013745, Compound EED226
Type:
Small organic molecule
Emp. Form.:
C17H15N5O3S
Mol. Mass.:
369.398
SMILES:
CS(=O)(=O)c1ccc(cc1)-c1cnc(NCc2ccco2)n2cnnc12
: