Target
Histone-lysine N-methyltransferase, H3 lysine-36 specific
Ligand
BDBM225230
Substrate
Meas. Tech.
HMT Assay
IC50
>1.00e+5±n/a nM
Citation
 Qi, WZhao, KGu, JHuang, YWang, YZhang, HZhang, MZhang, JYu, ZLi, LTeng, LChuai, SZhang, CZhao, MChan, HChen, ZFang, DFei, QFeng, LFeng, LGao, YGe, HGe, XLi, GLingel, ALin, YLiu, YLuo, FShi, MWang, LWang, ZYu, YZeng, JZeng, CZhang, LZhang, QZhou, SOyang, CAtadja, PLi, E An allosteric PRC2 inhibitor targeting the H3K27me3 binding pocket of EED. Nat Chem Biol 13:381-388 (2017)  
Target
Name:
Histone-lysine N-methyltransferase, H3 lysine-36 specific
Synonyms:
ARA267 KMT3B NSD1_HUMAN | Nuclear SET domain-containing protein 1 (NSD1)
Type:
Protein
Mol. Mass.:
296705.31
Organism:
Homo sapiens (Human)
Description:
Q96L73
Residue:
2696
  
Inhibitor
Name:
BDBM225230
Synonyms:
EED226 | US11013745, Compound EED226
Type:
Small organic molecule
Emp. Form.:
C17H15N5O3S
Mol. Mass.:
369.398
SMILES:
CS(=O)(=O)c1ccc(cc1)-c1cnc(NCc2ccco2)n2cnnc12
: