Target
Carbonic anhydrase 2
Ligand
BDBM224002
Substrate
Meas. Tech.
Fluorescence-Based CA II Binding Assay
pH
7±0
Temperature
298.15±0 K
IC50
1.55e+3± 12 nM
Citation
 Teruya, KRankin, GMChrysanthopoulos, PKTonissen, KFPoulsen, SA Characterisation of Photoaffinity-Based Chemical Probes by Fluorescence Imaging and Native-State Mass Spectrometry. Chembiochem 18:739-754 (2017)  
Target
Name:
Carbonic anhydrase 2
Synonyms:
CA-II CAC Carbonate dehydratase II Carbonic anhydrase 2 (CA-II) Carbonic anhydrase C Carbonic anhydrase II (CA-II) Carbonic anhydrase II (hCA II) | Carbonic anhydrase isoenzyme II (hCA II)
Type:
Enzyme
Mol. Mass.:
29250.71
Organism:
Homo sapiens (Human)
Description:
P00918
Residue:
260
  
Inhibitor
Name:
BDBM224002
Synonyms:
N-[(1S)-2-[1-(4-Benzoylphenyl)-1H-1,2,3-triazol-4-yl]-1-[(4-sulfamoylphenyl)carbamoyl]ethyl]-4,7,10,13,16-pentaoxanonadec-18-ynamide (9)
Type:
Small organic molecule
Emp. Form.:
C38H44N6O10S
Mol. Mass.:
776.855
SMILES:
NS(=O)(=O)c1ccc(NC(=O)[C@H](Cc2cn(nn2)-c2ccc(cc2)C(=O)c2ccccc2)NC(=O)CCOCCOCCOCCOCCOCC#C)cc1
: