Target
Serine/threonine-protein kinase pim-3
Ligand
BDBM224930
Substrate
Meas. Tech.
Enzyme Assay
IC50
73.18±n/a nM
Citation
 Wang, HCee, VJHerberich, BJJackson, CLLanman, BANixey, TPettus, LHReed, ABWu, BWurz, RTasker, A Azole compounds as PIM inhibitors US Patent  US9321756 Publication Date 4/26/2016 
Target
Name:
Serine/threonine-protein kinase pim-3
Synonyms:
PIM3 Serine/threonine-protein kinase pim-3 (PIM3)
Type:
Protein
Mol. Mass.:
35888.19
Organism:
Homo sapiens (Human)
Description:
Q86V86
Residue:
326
  
Inhibitor
Name:
BDBM224930
Synonyms:
US9321756, 189
Type:
Small organic molecule
Emp. Form.:
C18H17N7S
Mol. Mass.:
363.439
SMILES:
Nc1nnc(s1)-c1ccc2[nH]cc(-c3cnc(cn3)N3CCCC3)c2c1
: