Target
Isoform 1 of Metabotropic glutamate receptor 5 (5a)
Ligand
BDBM224626
Substrate
Meas. Tech.
MPEP Binding Assay
pH
7.4±n/a
Ki
28±n/a nM
Comments
extracted
Citation
 Jaeschke, GLindemann, LRicci, ARueher, DStadler, HVieira, E Ethynyl derivatives US Patent  US9328070 Publication Date 5/3/2016 
Target
Name:
Isoform 1 of Metabotropic glutamate receptor 5 (5a)
Synonyms:
GPRC1E GRM5_HUMAN Metabotropic glutamate receptor 5 Metabotropic glutamate receptor 5 (mGlu5a) Metabotropic glutamate receptor 5a (mGluR5) Metabotropic glutamate receptor subtype 5 (mGluR5)
Type:
Enzyme
Mol. Mass.:
128885.13
Organism:
Homo sapiens (Human)
Description:
P41594-2
Residue:
1180
  
Inhibitor
Name:
BDBM224626
Synonyms:
US9328070, 1
Type:
Small organic molecule
Emp. Form.:
C18H18ClN3O
Mol. Mass.:
327.808
SMILES:
CN(C(=O)c1ccc(cn1)C#Cc1ccnc(Cl)c1)C(C)(C)C
: