Target
Alpha-glucosidase MAL32
Ligand
BDBM225283
Substrate
Meas. Tech.
In Vitro α-Glucosidase Inhibitory Assay
pH
6.8±0
Temperature
310.15±0 K
IC50
3.009e+4± 1.5e+2 nM
Citation
 Wang, GWang, JXie, ZChen, MLi, LPeng, YChen, SLi, WDeng, B Discovery of 3,3-di(indolyl)indolin-2-one as a novel scaffold for a-glucosidase inhibitors: In silico studies and SAR predictions Bioorg Chem 72:228-233 (2017)   
Target
Name:
Alpha-glucosidase MAL32
Synonyms:
Alpha-glucosidase MAL32 MAL32_YEAST Maltase alpha-Glucosidase (alpha-Glu) | alpha-Glucosidase (α-Glucosidase)
Type:
Hydrolase
Mol. Mass.:
68132.36
Organism:
Saccharomyces cerevisiae
Description:
Purchased from Wako Fine Chemicals Co. Ltd.
Residue:
584
  
Inhibitor
Name:
BDBM225283
Synonyms:
5'-Methyl-1H,1''H-[3,3':3',3''-terindol]-2'(1'H)-one (4d)
Type:
Small organic molecule
Emp. Form.:
C25H19N3O
Mol. Mass.:
377.4379
SMILES:
Cc1ccc2NC(=O)C(c2c1)(c1c[nH]c2ccccc12)c1c[nH]c2ccccc12
: