Target
Malate synthase G [C619A]
Ligand
BDBM225396
Substrate
Meas. Tech.
DNTB-Coupled_Enzyme_Assay
IC50
>100000±n/a nM
Citation
 D3R, DD Sacchettini GlcB D3R 223:0 (2015) Target
Name:
Malate synthase G [C619A]
Synonyms:
MASZ_MYCTO | glcB
Type:
Mol. Mass.:
80350.85
Organism:
Mycobacterium tuberculosis (strain CDC 1551 / Oshkosh)
Description:
P9WK16[C619A]
Residue:
741
  
Inhibitor
Name:
BDBM225396
Synonyms:
Sacchettini_23
Type:
Small Organic Molecule
Emp. Form.:
C11H11NO5
Mol. Mass.:
237.2087
SMILES:
COc1cccc(NC(=O)\C=C(/O)C(O)=O)c1
: