Target
Acetylcholinesterase
Ligand
BDBM7458
Substrate
Meas. Tech.
Acetylcholinesterase Inhibitory Assay
pH
8±n/a
Temperature
298.15±n/a K
IC50
64270±4410 nM
Comments
extracted
Citation
 Nguyen, DHSeo, UMZhao, BTLe, DDSeong, SHChoi, JSMin, BSWoo, MH Ellagitannin and flavonoid constituents from Agrimonia pilosa Ledeb. with their protein tyrosine phosphatase and acetylcholinesterase inhibitory activities Bioorg Chem 72:293-300 (2017)   
Target
Name:
Acetylcholinesterase
Synonyms:
ACES_HUMAN Acetylcholinesterase (AChE) | Acetylcholinesterase (human AChE)
Type:
Enzyme
Mol. Mass.:
67792.70
Organism:
Homo sapiens (Human)
Description:
P22303
Residue:
614
  
Inhibitor
Name:
BDBM7458
Synonyms:
5,7-dihydroxy-2-(4-hydroxyphenyl)-4H-chromen-4-one Apigenin Apigenin (3) Apigenin, 13 Naringenin, 18 US11337935, Compound Apigenin cid_5280443 | jm5b01461, Compound 90
Type:
Small organic molecule
Emp. Form.:
C15H10O5
Mol. Mass.:
270.2369
SMILES:
Oc1ccc(cc1)-c1cc(=O)c2c(O)cc(O)cc2o1
: