Target
Acetylcholinesterase
Ligand
BDBM50378582
Substrate
Meas. Tech.
Acetylcholinesterase Inhibitory Assay
pH
8±n/a
Temperature
298.15±n/a K
IC50
100000±n/a nM
Comments
extracted
Citation
 Nguyen, DHSeo, UMZhao, BTLe, DDSeong, SHChoi, JSMin, BSWoo, MH Ellagitannin and flavonoid constituents from Agrimonia pilosa Ledeb. with their protein tyrosine phosphatase and acetylcholinesterase inhibitory activities Bioorg Chem 72:293-300 (2017)   
Target
Name:
Acetylcholinesterase
Synonyms:
ACES_HUMAN Acetylcholinesterase (AChE) | Acetylcholinesterase (human AChE)
Type:
Enzyme
Mol. Mass.:
67792.70
Organism:
Homo sapiens (Human)
Description:
P22303
Residue:
614
  
Inhibitor
Name:
BDBM50378582
Synonyms:
APIGETRIN NSC-407303
Type:
Small organic molecule
Emp. Form.:
C21H20O10
Mol. Mass.:
432.3775
SMILES:
OC[C@H]1O[C@@H](Oc2cc(O)c3c(c2)oc(cc3=O)-c2ccc(O)cc2)[C@H](O)[C@@H](O)[C@@H]1O
: