Target
Acetylcholinesterase
Ligand
BDBM50203126
Substrate
Meas. Tech.
Acetylcholinesterase Inhibitory Assay
pH
8±n/a
Temperature
298.15±n/a K
IC50
770±20 nM
Comments
extracted
Citation
 Nguyen, DHSeo, UMZhao, BTLe, DDSeong, SHChoi, JSMin, BSWoo, MH Ellagitannin and flavonoid constituents from Agrimonia pilosa Ledeb. with their protein tyrosine phosphatase and acetylcholinesterase inhibitory activities Bioorg Chem 72:293-300 (2017)   
Target
Name:
Acetylcholinesterase
Synonyms:
ACES_HUMAN Acetylcholinesterase (AChE) | Acetylcholinesterase (human AChE)
Type:
Enzyme
Mol. Mass.:
67792.70
Organism:
Homo sapiens (Human)
Description:
P22303
Residue:
614
  
Inhibitor
Name:
BDBM50203126
Synonyms:
3,4-dimethoxy-6,7-dihydro-[1,3]dioxolo[4,5-g]pyrido[2,1-a]isoquinolin-5-ylium 9,10-Dimethoxy-5,6-dihydro-[1,3]dioxolo[4,5-g]isoquino[3,2-a]isoquinolin-7-ylium chloride BERBERINE CHEMBL12089 cid_12456
Type:
Small organic molecule
Emp. Form.:
C20H18NO4
Mol. Mass.:
336.3607
SMILES:
COc1ccc2cc3-c4cc5OCOc5cc4CC[n+]3cc2c1OC
: