Target
Cannabinoid receptor 1
Ligand
BDBM227552
Substrate
Meas. Tech.
cAMP Activation Assay
EC50
0.14±0.1 nM
Citation
 Attala, MNDiaz, P Heterocyclic modulators of cannabinoid receptors US Patent  US9339486 Publication Date 5/17/2016 
Target
Name:
Cannabinoid receptor 1
Synonyms:
Brain-type cannabinoid receptor CB-R CNR1_RAT Cannabinoid receptor Cnr1 | Skr6
Type:
G Protein-Coupled Receptor (GPCR)
Mol. Mass.:
52856.55
Organism:
Rattus norvegicus (rat)
Description:
P20272
Residue:
473
  
Inhibitor
Name:
BDBM227552
Synonyms:
US9339486, CP55,940
Type:
Small organic molecule
Emp. Form.:
C24H40O3
Mol. Mass.:
376.5726
SMILES:
CCCCCCC(C)(C)c1ccc(C2CC(O)CCC2CCCO)c(O)c1
: