Target
Androgen receptor [646-919]
Ligand
BDBM227646
Substrate
Meas. Tech.
Fluorescence Polarization Assay
pH
6.5±n/a
Kd
3.3e+3± 1.3e+3 nM
Comments
extracted
Citation
 Jehle, KCato, LNeeb, AMuhle-Goll, CJung, NSmith, EWBuzon, VCarbó, LREstébanez-Perpiñá, ESchmitz, KFruk, LLuy, BChen, YCox, MBBräse, SBrown, MCato, AC Coregulator control of androgen receptor action by a novel nuclear receptor-binding motif. J Biol Chem 289:8839-51 (2014)  
Target
Name:
Androgen receptor [646-919]
Synonyms:
ANDR_HUMAN Androgen receptor ligand-binding domain (AR-LBD) NR3C4
Type:
Protein
Mol. Mass.:
31698.13
Organism:
Homo sapiens (Human)
Description:
Human AR hinge-LBD (646-919 aa)
Residue:
274
  
Inhibitor
Name:
BDBM227646
Synonyms:
Bag-1L (61-80) | RGAAAGARRPRMKKKTRRRS
Type:
Small organic molecule
Emp. Form.:
C93H176N44O23S
Mol. Mass.:
2310.739
SMILES:
CSCC[C@H](NC(=O)[C@H](CCCNC(N)=N)NC(=O)[C@@H]1CCCN1C(=O)[C@H](CCCNC(N)=N)NC(=O)[C@H](CCCNC(N)=N)NC(=O)[C@H](C)NC(=O)CNC(=O)[C@H](C)NC(=O)[C@H](C)NC(=O)[C@H](C)NC(=O)CNC(=O)[C@@H](N)CCCNC(N)=N)C(=O)N[C@@H](CCCCN)C(=O)N[C@@H](CCCCN)C(=O)N[C@@H](CCCCN)C(=O)N[C@@H]([C@@H](C)O)C(=O)N[C@@H](CCCNC(N)=N)C(=O)N[C@@H](CCCNC(N)=N)C(=O)N[C@@H](CCCNC(N)=N)C(=O)N[C@@H](CO)C(O)=O
: