Target
Genome polyprotein [1027-1711]
Ligand
BDBM229559
Substrate
Meas. Tech.
Reporter Assay
Temperature
310.15±n/a K
EC50
0.75±0.25 nM
Comments
extracted
Citation
 Gillis, EPBowsher, MSScola, PM Hepatitis C virus inhibitors US Patent  US9334279 Publication Date 5/10/2016 
Target
Name:
Genome polyprotein [1027-1711]
Synonyms:
NS3-NS4A Protease POLG_HCV77
Type:
Mol. Mass.:
72913.15
Organism:
Hepatitis C virus genotype 1a (strain H77) (HCV)
Description:
amino acids 1027 to 1711
Residue:
685
  
Inhibitor
Name:
BDBM229559
Synonyms:
US9334279, 1035
Type:
Small organic molecule
Emp. Form.:
C48H59F3N6O11S2
Mol. Mass.:
1017.141
SMILES:
CC[C@@H]1O[C@H](C)CC\C=C/[C@@H]2C[C@]2(NC(=O)[C@@H]2C[C@H](CN2C(=O)[C@H]1NC(=O)OC1(CCCOC1)C(F)(F)F)Oc1cc(nc(c1)-c1ccc(OC(C)C)cc1)-c1nccs1)C(=O)NS(=O)(=O)C1(C)CC1
: