Target
Activin receptor type-1B
Ligand
BDBM143313
Substrate
Meas. Tech.
ALK1-6 enzymatic assays
pH
7.5±n/a
IC50
259±n/a nM
Comments
extracted
Citation
 Alimardanov, ACuny, GDGrewal, GSLee, AMcKew, JCMohedas, AHShen, MXu, XYu, PB BMP inhibitors and methods of use thereof US Patent  US9682983 Publication Date 6/20/2017 
Target
Name:
Activin receptor type-1B
Synonyms:
ACV1B_HUMAN ACVRLK4 Activin receptor type-1B/Activin receptor-like kinase 4 (ALK-4)
Type:
PROTEIN
Mol. Mass.:
56810.99
Organism:
Homo sapiens (Human)
Description:
ChEMBL_587064
Residue:
505
  
Inhibitor
Name:
BDBM143313
Synonyms:
US10017516, Compound 12 | US9682983, 12
Type:
Small organic molecule
Emp. Form.:
C25H23N7
Mol. Mass.:
421.497
SMILES:
Cc1cc(-c2cnn3cc(cnc23)-c2ccc(nc2)N2CCNCC2)c2ccccc2n1
: