Target
Bone morphogenetic protein receptor type-1B
Ligand
BDBM143313
Substrate
Meas. Tech.
ALK1-6 enzymatic assays
pH
7.5±n/a
IC50
150±n/a nM
Comments
extracted
Citation
 Alimardanov, ACuny, GDGrewal, GSLee, AMcKew, JCMohedas, AHShen, MXu, XYu, PB BMP inhibitors and methods of use thereof US Patent  US9682983 Publication Date 6/20/2017 
Target
Name:
Bone morphogenetic protein receptor type-1B
Synonyms:
ALK-6 BMPR1B Bone morphogenetic protein receptor type-1B (BMPR1B)
Type:
Enzyme
Mol. Mass.:
56939.41
Organism:
Homo sapiens (Human)
Description:
O00238
Residue:
502
  
Inhibitor
Name:
BDBM143313
Synonyms:
US10017516, Compound 12 | US9682983, 12
Type:
Small organic molecule
Emp. Form.:
C25H23N7
Mol. Mass.:
421.497
SMILES:
Cc1cc(-c2cnn3cc(cnc23)-c2ccc(nc2)N2CCNCC2)c2ccccc2n1
: