Target
Bone morphogenetic protein receptor type-1B
Ligand
BDBM161910
Substrate
Meas. Tech.
ALK1-6 enzymatic assays
pH
7.5±n/a
IC50
5000±n/a nM
Comments
extracted
Citation
 Alimardanov, ACuny, GDGrewal, GSLee, AMcKew, JCMohedas, AHShen, MXu, XYu, PB BMP inhibitors and methods of use thereof US Patent  US9682983 Publication Date 6/20/2017 
Target
Name:
Bone morphogenetic protein receptor type-1B
Synonyms:
ALK-6 BMPR1B Bone morphogenetic protein receptor type-1B (BMPR1B)
Type:
Enzyme
Mol. Mass.:
56939.41
Organism:
Homo sapiens (Human)
Description:
O00238
Residue:
502
  
Inhibitor
Name:
BDBM161910
Synonyms:
US10017516, Compound 42 | US9682983, 42
Type:
Small organic molecule
Emp. Form.:
C26H25N7O
Mol. Mass.:
451.523
SMILES:
C(CN1CCNCC1)Oc1ccc(cn1)-c1cnc2c(cnn2c1)-c1cccc2ncccc12
: