Target
Bone morphogenetic protein receptor type-1B
Ligand
BDBM161928
Substrate
Meas. Tech.
ALK1-6 enzymatic assays
pH
7.5±n/a
IC50
1112±n/a nM
Comments
extracted
Citation
 Alimardanov, ACuny, GDGrewal, GSLee, AMcKew, JCMohedas, AHShen, MXu, XYu, PB BMP inhibitors and methods of use thereof US Patent  US9682983 Publication Date 6/20/2017 
Target
Name:
Bone morphogenetic protein receptor type-1B
Synonyms:
ALK-6 BMPR1B Bone morphogenetic protein receptor type-1B (BMPR1B)
Type:
Enzyme
Mol. Mass.:
56939.41
Organism:
Homo sapiens (Human)
Description:
O00238
Residue:
502
  
Inhibitor
Name:
BDBM161928
Synonyms:
US10017516, Compound 60 | US9682983, 60
Type:
Small organic molecule
Emp. Form.:
C27H26N6O
Mol. Mass.:
450.5349
SMILES:
CN1CCC(CC1)Oc1ccc(nc1)-c1cnc2c(cnn2c1)-c1cccc2nc(C)ccc12
: