Target
Sodium/glucose cotransporter 2
Ligand
BDBM159528
Substrate
Meas. Tech.
SGLT2 Inhibition Assay
pH
7.4±n/a
Temperature
310.15±n/a K
IC50
0.37±n/a nM
Comments
extracted
Citation
 Choi, SKim, JESong, KLee, SHPark, KSeo, HJKim, MJPark, EPark, SOKong, YKang, HSon, IJung, MECha, MKim, HJLee, JSKim, MLee, MWLee, K Method for dual inhibition of SGLT1 and SGLT2 using diphenylmethane derivatives US Patent  US9340521 Publication Date 5/17/2016 
Target
Name:
Sodium/glucose cotransporter 2
Synonyms:
Na(+)/glucose cotransporter 2 SGLT2 Sodium-Dependent Glucose Cotransporter 2 (SGLT2) Solute carrier family 5 member 2
Type:
Protein
Mol. Mass.:
72902.00
Organism:
Homo sapiens (Human)
Description:
P31639
Residue:
672
  
Inhibitor
Name:
BDBM159528
Synonyms:
US9034921, E171 | US9340521, E028
Type:
Small organic molecule
Emp. Form.:
C23H25ClO6
Mol. Mass.:
432.894
SMILES:
OC[C@H]1O[C@H]([C@H](O)[C@@H](O)[C@@H]1O)c1cc(Cc2ccc(C=C)cc2)c(Cl)c2OCCc12
: