Target
Tyrosine-protein kinase JAK3 [781-1124]
Ligand
BDBM228743
Substrate
Meas. Tech.
Enzymatic Assay
Temperature
298.15±n/a K
IC50
0.055±0.055 nM
Comments
extracted
Citation
 Su, WDeng, WLi, JJi, J Pyrrolopyrimidine compounds and uses thereof US Patent  US9346810 Publication Date 5/24/2016 
Target
Name:
Tyrosine-protein kinase JAK3 [781-1124]
Synonyms:
JAK3 JAK3_HUMAN Tyrosine-protein kinase JAK3 Tyrosine-protein kinase JAK3 (aa 781-1124)
Type:
Mol. Mass.:
38772.27
Organism:
Homo sapiens (Human)
Description:
P52333[781-1124]
Residue:
344
  
Inhibitor
Name:
BDBM228743
Synonyms:
US9346810, 162
Type:
Small Organic Molecule
Emp. Form.:
C18H18N6
Mol. Mass.:
318.3757
SMILES:
CN([C@@H]1CCN(C1)c1ncnc2[nH]ccc12)c1ccc(cn1)C#C
: