Target
Tyrosine-protein kinase JAK3 [781-1124]
Ligand
BDBM228723
Substrate
Meas. Tech.
Enzymatic Assay
Temperature
298.15±n/a K
IC50
0.55±0.55 nM
Comments
extracted
Citation
 Su, WDeng, WLi, JJi, J Pyrrolopyrimidine compounds and uses thereof US Patent  US9346810 Publication Date 5/24/2016 
Target
Name:
Tyrosine-protein kinase JAK3 [781-1124]
Synonyms:
JAK3 JAK3_HUMAN Tyrosine-protein kinase JAK3 Tyrosine-protein kinase JAK3 (aa 781-1124)
Type:
Mol. Mass.:
38772.27
Organism:
Homo sapiens (Human)
Description:
P52333[781-1124]
Residue:
344
  
Inhibitor
Name:
BDBM228723
Synonyms:
US10369153, Compound 84 | US9346810, 84
Type:
Small Organic Molecule
Emp. Form.:
C16H16N8
Mol. Mass.:
320.3518
SMILES:
CN([C@@H]1CCN(C1)c1ncnc2[nH]ccc12)c1cnc(cn1)C#N
: