Target
Tyrosine-protein kinase JAK3 [781-1124]
Ligand
BDBM228757
Substrate
Meas. Tech.
Enzymatic Assay
Temperature
298.15±n/a K
IC50
0.55±0.55 nM
Comments
extracted
Citation
 Su, WDeng, WLi, JJi, J Pyrrolopyrimidine compounds and uses thereof US Patent  US9346810 Publication Date 5/24/2016 
Target
Name:
Tyrosine-protein kinase JAK3 [781-1124]
Synonyms:
JAK3 JAK3_HUMAN Tyrosine-protein kinase JAK3 Tyrosine-protein kinase JAK3 (aa 781-1124)
Type:
Mol. Mass.:
38772.27
Organism:
Homo sapiens (Human)
Description:
P52333[781-1124]
Residue:
344
  
Inhibitor
Name:
BDBM228757
Synonyms:
US10369153, Compound 201 | US9346810, 201
Type:
Small Organic Molecule
Emp. Form.:
C26H26ClFN6O2
Mol. Mass.:
508.975
SMILES:
CN([C@@H]1CCN(C1)c1ncnc2[nH]ccc12)c1ccc(cc1F)C(=O)NC(CO)c1ccc(Cl)cc1
: