Target
Cyclin-dependent kinase/G2/mitotic-specific cyclin- 1
Ligand
BDBM6278
Substrate
GST-Rb fusion protein
Meas. Tech.
CDKs Assay
IC50
79±n/a nM
Citation
 Barvian, MBoschelli, DHCossrow, JDobrusin, EFattaey, AFritsch, AFry, DHarvey, PKeller, PGarrett, MLa, FLeopold, WMcNamara, DQuin, MTrumpp-Kallmeyer, SToogood, PWu, ZZhang, E Pyrido[2,3-d]pyrimidin-7-one inhibitors of cyclin-dependent kinases. J Med Chem 43:4606-16 (2000)  
Target
Name:
Cyclin-dependent kinase/G2/mitotic-specific cyclin- 1
Synonyms:
CDK1/B CDK1/CyclinB Cyclin-Dependent Kinase 1 (CDK1) Cyclin-dependent kinase/G2/mitotic-specific cyclin 1 | cdk1
Type:
Protein Complex
Mol. Mass.:
Description:
CDK1/Cyclin B complexes were purified from insect cells co-infected with baculovirus vectors containing each of the components.
Components:
This complex has 2 components.
Component 1
Name:
Cyclin-dependent kinase 1
Synonyms:
CDC2 CDK1 CDKN1 Cell division protein kinase 1 P34CDC2 | p34 protein kinase
Type:
Enzyme Subunit
Mol. Mass.:
34101.08
Organism:
Homo sapiens (Human)
Description:
P06493
Residue:
297
  
Component 2
Name:
G2/mitotic-specific cyclin-B1
Synonyms:
CCNB CCNB1_HUMAN
Type:
Enzyme Subunit
Mol. Mass.:
48340.95
Organism:
Homo sapiens (Human)
Description:
P14635
Residue:
433
  
Inhibitor
Name:
BDBM6278
Synonyms:
8-Cyclohexyl-2-[4-(4-methylpiperazin-1-yl)phenylamino]-8H-pyrido[2,3-d]pyrimidin-7-one N8 Pyrido[2,3-d]pyrimidin-7-one deriv. 70
Type:
Small organic molecule
Emp. Form.:
C24H30N6O
Mol. Mass.:
418.5346
SMILES:
CN1CCN(CC1)c1ccc(Nc2ncc3ccc(=O)n(C4CCCCC4)c3n2)cc1
:
Substrate
Name:
GST-Rb fusion protein
Synonyms:
Glutathione S-transferase (GST)-retinoblastoma (Rb) fusion RB1 Rb | retinoblastoma
Type:
Other Protein Type
Mol. Mass.:
106410.17
Organism:
Homo sapiens (Human)
Description:
GST-60 kDa Rb fusion protein (comprising amino acids 378 to 928 of retinoblastoma)
Residue:
928