Target
Isocitrate dehydrogenase [NADP] cytoplasmic [R132H]
Ligand
BDBM228658
Substrate
Meas. Tech.
IDH1 Biochemical Assay
IC50
96±1.2 nM
Citation
 Davis, MIGross, SShen, MStraley, KSPragani, RLea, WAPopovici-Muller, JDeLaBarre, BArtin, EThorne, NAuld, DSLi, ZDang, LBoxer, MBSimeonov, A Biochemical, cellular, and biophysical characterization of a potent inhibitor of mutant isocitrate dehydrogenase IDH1. J Biol Chem 289:13717-25 (2014)  
Target
Name:
Isocitrate dehydrogenase [NADP] cytoplasmic [R132H]
Synonyms:
Cytosolic NADP-isocitrate dehydrogenase (IDH1)(R132H) IDH1 R132H IDHC_HUMAN Isocitrate dehydrogenase 1 mutant (R132H) Isocitrate dehydrogenase [NADP] cytoplasmic (IDH1)(R132H) PICD
Type:
Protein
Mol. Mass.:
46641.74
Organism:
Homo sapiens (Human)
Description:
Human IDH1 R132H (SEQ ID No. 2 in patent). First three are removed. Google patent parsed wrong.
Residue:
414
  
Inhibitor
Name:
BDBM228658
Synonyms:
rac-ML309
Type:
Small organic molecule
Emp. Form.:
C29H29FN4O2
Mol. Mass.:
484.5646
SMILES:
Cc1ccccc1C(N(C(=O)Cn1cnc2ccccc12)c1cccc(F)c1)C(=O)NC1CCCC1
: