Target
Melanocyte-stimulating hormone receptor
Ligand
BDBM230657
Substrate
Meas. Tech.
Radioligand Binding Assay
pH
7.4±n/a
Temperature
277.15±n/a K
IC50
9220±n/a nM
Comments
extracted
Citation
 Blaskovich, MACassidy, PJ Methods of modulating the activity of the MC5 receptor and treatment of conditions related to this receptor US Patent  US9340517 Publication Date 5/17/2016 
Target
Name:
Melanocyte-stimulating hormone receptor
Synonyms:
MC1-R MSH-R MSHR_HUMAN Melanocortin receptor (M1 and M4) Melanocortin receptor 1 (MC1-R) | Melanocortin receptor 1 (MC1R)
Type:
Enzyme
Mol. Mass.:
34717.23
Organism:
Homo sapiens (Human)
Description:
Q01726
Residue:
317
  
Inhibitor
Name:
BDBM230657
Synonyms:
US9340517, 64
Type:
Small organic molecule
Emp. Form.:
C39H46N4O2
Mol. Mass.:
602.8081
SMILES:
O=C(NC[C@H]1CCN(CC(c2ccccc2)c2ccccc2)C(=O)[C@@H](CCCN2CCCCC2)N1)c1ccc2ccccc2c1
: