Target
Tyrosine-protein kinase ABL1 [64-515]
Ligand
BDBM230814
Substrate
Meas. Tech.
Caliper Assay
pH
7.5±n/a
Temperature
303.15±n/a K
IC50
<0.13±n/a nM
Comments
extracted
Citation
 Furet, PGrotzfeld, RMJahnke, WJones, DBManley, PWMarzinzik, APelle, XFSalem, BSchoepfer, J Benzamide derivatives for inhibiting the activity of ABL1, ABL2 and BCR-ABL1 US Patent  US9340537 Publication Date 5/17/2016 
Target
Name:
Tyrosine-protein kinase ABL1 [64-515]
Synonyms:
ABL ABL1_HUMAN Tyrosine-protein kinase ABL1 Tyrosine-protein kinase ABL1 (ABL) | Tyrosine-protein kinase ABL1 (ABL1)
Type:
Enzyme Catalytic Domain
Mol. Mass.:
51539.77
Organism:
Homo sapiens (Human)
Description:
aa 64-515
Residue:
452
  
Inhibitor
Name:
BDBM230814
Synonyms:
US9340537, 68 | US9896444, Example 68
Type:
Small organic molecule
Emp. Form.:
C21H19ClF2N6O2
Mol. Mass.:
460.864
SMILES:
FC(F)(Cl)Oc1ccc(NC(=O)c2cnc(N3CC4(CNC4)C3)c(c2)-c2ccn[nH]2)cc1
: