Target
Guanine nucleotide-binding protein subunit alpha-15 [Y147C]/N-formyl peptide receptor 2
Ligand
BDBM230855
Substrate
Meas. Tech.
Intracellular Calcium Assay
EC50
12.7±n/a nM
Citation
 Bur, DCorminboeuf, OCren, SGrisostomi, CLeroy, XRichard-Bildstein, S Hydroxylated aminotriazole derivatives as ALX receptor agonists US Patent  US9346793 Publication Date 5/24/2016 
Target
Name:
Guanine nucleotide-binding protein subunit alpha-15 [Y147C]/N-formyl peptide receptor 2
Synonyms:
ALX receptor and the G-protein Gα16
Type:
Protein
Mol. Mass.:
Description:
Components:
This complex has 2 components.
Component 1
Name:
N-formyl peptide receptor 2
Synonyms:
ALXR, FPRL1, FPR2 FPR2 FPRH1 Formyl Peptide Receptor-Like 1 LXA4 receptor Lipoxin A4 receptor RFP | hFPRL
Type:
G Protein-Coupled Receptor (GPCR)
Mol. Mass.:
38968.35
Organism:
Homo sapiens (Human)
Description:
P25090
Residue:
351
  
Component 2
Name:
Guanine nucleotide-binding protein subunit alpha-15 [Y147C]
Synonyms:
G protein alpha 16 GNA15_HUMAN | GNA16
Type:
Enzyme
Mol. Mass.:
43517.59
Organism:
Homo sapiens (Human)
Description:
P30679[Y147C]
Residue:
374
  
Inhibitor
Name:
BDBM230855
Synonyms:
US9346793, 6
Type:
Small organic molecule
Emp. Form.:
C21H22N6O5
Mol. Mass.:
438.4366
SMILES:
COc1cccc(c1)-c1oc(C)nc1C(=O)Nc1cnn(Cc2nc(co2)C(C)(C)O)n1
: