Target
Beta-secretase 1
Ligand
BDBM230869
Substrate
Meas. Tech.
BACE1 Binding Assay
pH
4.5±n/a
Temperature
298.15±n/a K
Ki
14±n/a nM
Comments
extracted
Citation
 Juhl, KTagmose, LMarigo, M 2-amino 6-(difluoromethyl)-5,5-difluoro-6-phenyl-3,4,5,6-tetrahydropyridines as BACE1 inhibitors US Patent  US9346797 Publication Date 5/24/2016 
Target
Name:
Beta-secretase 1
Synonyms:
ASP2 Aspartyl protease 2 BACE1 Beta-secretase (BACE) Beta-secretase 1 (BACE 1) Beta-secretase 1 (BACE1) Beta-site amyloid precursor protein cleaving enzyme 1 Memapsin-2 beta-Secretase (BACE-1) | beta-Secretase (BACE1)
Type:
Protein
Mol. Mass.:
55755.10
Organism:
Homo sapiens (Human)
Description:
P56817
Residue:
501
  
Inhibitor
Name:
BDBM230869
Synonyms:
US10045974, 13 US9346797, 13 | US9346797, 5
Type:
Small organic molecule
Emp. Form.:
C19H17F5N4O2
Mol. Mass.:
428.3559
SMILES:
COc1ccc(nc1)C(=O)Nc1ccc(F)c(c1)[C@]1(N=C(N)CCC1(F)F)C(F)F
: