Target
ALK tyrosine kinase receptor [L1196M]
Ligand
BDBM291993
Substrate
Meas. Tech.
Inhibition of ALK L1196M Anaplastic Lymphoma Kinase Activity
IC50
1.90±n/a nM
Citation
 Kim, PKim, HRCho, SYHa, JDJung, HJYun, CSHwang, JYPark, CHLee, COAhn, SChae, CH N2-(2-methoxyphenyl)pyrimidine derivative, method for preparing same, and pharmaceutical composition for cancer prevention or treatment containing same as active ingredient US Patent  US10100019 Publication Date 10/16/2018 
Target
Name:
ALK tyrosine kinase receptor [L1196M]
Synonyms:
ALK ALK tyrosine kinase receptor (ALK) (L1196M) ALK tyrosine kinase receptor (L1196M) Anaplastic lymphoma kinase L1196M (ALK L1196M) | Tyrosine-protein kinase receptor [L1196M]
Type:
Mol. Mass.:
176471.13
Organism:
Homo sapiens (Human)
Description:
Q9UM73[L1196M]
Residue:
1620
  
Inhibitor
Name:
BDBM291993
Synonyms:
US10100019, Example 63
Type:
Small organic molecule
Emp. Form.:
C24H30ClN5O3S
Mol. Mass.:
504.045
SMILES:
CNCCc1cc(OC)c(Nc2ncc(Cl)c(Nc3ccccc3S(=O)(=O)C(C)C)n2)cc1C
: