Target
Aldo-keto reductase family 1 member C2
Ligand
BDBM50427621
Substrate
Meas. Tech.
Inhibition Assay
IC50
50.13±n/a nM
Citation
 Marnett, LJLiedtke, AJPenning, TMAdeniji, AOByrns, MC Indomethacin analogs for the treatment of castrate-resistant prostate cancer US Patent  US9346803 Publication Date 5/24/2016 
Target
Name:
Aldo-keto reductase family 1 member C2
Synonyms:
3-alpha-HSD3 AK1C2_HUMAN Aldo-keto reductase family 1 member C2 (AK1C2) Aldo-keto reductase family 1 member C2 (AKR1C2) DD-2 DDH2 Dihydrodiol dehydrogenase/bile acid-binding protein Type III 3-alpha-hydroxysteroid dehydrogenase
Type:
Enzyme
Mol. Mass.:
36739.89
Organism:
Homo sapiens (Human)
Description:
Residue:
323
  
Inhibitor
Name:
BDBM50427621
Synonyms:
CHEMBL2323490 | US9346803, 1
Type:
Small organic molecule
Emp. Form.:
C19H14ClF3N2O5S
Mol. Mass.:
474.838
SMILES:
COc1ccc2n(cc(CC(=O)NS(=O)(=O)C(F)(F)F)c2c1)C(=O)c1ccc(Cl)cc1
: