Target
Aldo-keto reductase family 1 member C4
Ligand
BDBM50427622
Substrate
Meas. Tech.
Inhibition Assay
IC50
1.95±n/a nM
Citation
 Marnett, LJLiedtke, AJPenning, TMAdeniji, AOByrns, MC Indomethacin analogs for the treatment of castrate-resistant prostate cancer US Patent  US9346803 Publication Date 5/24/2016 
Target
Name:
Aldo-keto reductase family 1 member C4
Synonyms:
3-alpha-HSD1 3-alpha-hydroxysteroid dehydrogenase type I AKR1C4 Aldo-keto reductase family 1 member C4 (AK1C4) CHDR DD-4 Dihydrodiol dehydrogenase 4 | HAKRA
Type:
Enzyme
Mol. Mass.:
37068.40
Organism:
Homo sapiens (Human)
Description:
P17516
Residue:
323
  
Inhibitor
Name:
BDBM50427622
Synonyms:
CHEMBL2323508 | US9346803, Table 2, Compound 10: 3-[1-(4-chlorobenzoyl)-3-ethyl-5-methoxy-1H-indol-2-yl]propanoic acid
Type:
Small organic molecule
Emp. Form.:
C21H20ClNO4
Mol. Mass.:
385.841
SMILES:
CCc1c(CCC(O)=O)n(C(=O)c2ccc(Cl)cc2)c2ccc(OC)cc12
: