Target
Olfactory receptor class A-like protein 1
Ligand
BDBM231633
Substrate
Meas. Tech.
Functional Calcium Imaging Assay
pH
7.4±n/a
EC50
1.60e+4± 3.6e+3 nM
Comments
extracted
Citation
 Behrens, MFrank, ORawel, HAhuja, GPotting, CHofmann, TMeyerhof, WKorsching, S ORA1, a zebrafish olfactory receptor ancestral to all mammalian V1R genes, recognizes 4-hydroxyphenylacetic acid, a putative reproductive pheromone. J Biol Chem 289:19778-88 (2014)  
Target
Name:
Olfactory receptor class A-like protein 1
Synonyms:
ORA1_DANRE Vlr2 | ora1
Type:
Protein
Mol. Mass.:
34536.30
Organism:
Danio rerio (Zebrafish)
Description:
Q597G5
Residue:
316
  
Inhibitor
Name:
BDBM231633
Synonyms:
3,4-Methylenedioxyphenylacetic acid
Type:
Small organic molecule
Emp. Form.:
C9H8O4
Mol. Mass.:
180.1574
SMILES:
OC(=O)Cc1ccc2OCOc2c1
: