Target
Tyrosine-protein kinase ABL1 [131-238]
Ligand
BDBM231647
Substrate
Meas. Tech.
Fluorescence Polarization Assay
pH
7.25±n/a
Kd
3.33e+3± 5.3e+2 nM
Comments
extracted
Citation
 Gifford, SMLiu, WMader, CCHalo, TLMachida, KBoggon, TJKoleske, AJ Two amino acid residues confer different binding affinities of Abelson family kinase SRC homology 2 domains for phosphorylated cortactin. J Biol Chem 289:19704-13 (2014)  
Target
Name:
Tyrosine-protein kinase ABL1 [131-238]
Synonyms:
ABL ABL1_HUMAN JTK7
Type:
Protein
Mol. Mass.:
12162.87
Organism:
Homo sapiens (Human)
Description:
Truncated human ABL (131-238 aa)
Residue:
108
  
Inhibitor
Name:
BDBM231647
Synonyms:
SSPIpYEDAA | pY421
Type:
Small organic molecule
Emp. Form.:
C41H62N9O20P
Mol. Mass.:
1031.953
SMILES:
CC[C@H](C)[C@H](NC(=O)[C@@H]1CCCN1C(=O)[C@H](CO)NC(=O)[C@@H](N)CO)C(=O)N[C@@H](Cc1ccc(OP(O)(O)=O)cc1)C(=O)N[C@@H](CCC(O)=O)C(=O)N[C@@H](CC(O)=O)C(=O)N[C@@H](C)C(=O)N[C@@H](C)C(O)=O
: