Target
Cyclin-dependent kinase 4/G1/S-specific cyclin-D1 [L188C]
Ligand
BDBM6327
Substrate
GST-Rb fusion protein
Meas. Tech.
CDKs Assay
IC50
30±n/a nM
Citation
 Toogood, PLHarvey, PJRepine, JTSheehan, DJVanderWel, SNZhou, HKeller, PRMcNamara, DJSherry, DZhu, TBrodfuehrer, JChoi, CBarvian, MRFry, DW Discovery of a potent and selective inhibitor of cyclin-dependent kinase 4/6. J Med Chem 48:2388-406 (2005)  
Target
Name:
Cyclin-dependent kinase 4/G1/S-specific cyclin-D1 [L188C]
Synonyms:
CDK4/Cyclin D | Cyclin-Dependent Kinase 4 (CDK4)
Type:
Protein Complex
Mol. Mass.:
Description:
CDK4/D complexes were purified from insect cells co-infected with baculovirus vectors containing each of the components.
Components:
This complex has 2 components.
Component 1
Name:
Cyclin-dependent kinase 4
Synonyms:
CDK4 Cell division protein kinase 4 PSK-J3
Type:
Enzyme Subunit
Mol. Mass.:
33731.96
Organism:
Homo sapiens (Human)
Description:
P11802
Residue:
303
  
Component 2
Name:
G1/S-specific cyclin-D1 [L188C]
Synonyms:
BCL1 CCND1_HUMAN PRAD1
Type:
Enzyme Subunit
Mol. Mass.:
33634.57
Organism:
Homo sapiens (Human)
Description:
P24385[L188C]
Residue:
295
  
Inhibitor
Name:
BDBM6327
Synonyms:
6-Acetyl-8-cyclopentyl-2-[5-(2,6-dimethyl-morpholin-4-yl)-pyridin-2-ylamino]-5-methyl-8H-pyrido[2,3-d]pyrimidin-7-one Pyrido-[2,3-d]-pyrimidin-7-one 61
Type:
Small organic molecule
Emp. Form.:
C26H32N6O3
Mol. Mass.:
476.5707
SMILES:
CC1CN(CC(C)O1)c1ccc(Nc2ncc3c(C)c(C(C)=O)c(=O)n(C4CCCC4)c3n2)nc1
:
Substrate
Name:
GST-Rb fusion protein
Synonyms:
Glutathione S-transferase (GST)-retinoblastoma (Rb) fusion RB1 Rb | retinoblastoma
Type:
Other Protein Type
Mol. Mass.:
106410.17
Organism:
Homo sapiens (Human)
Description:
GST-60 kDa Rb fusion protein (comprising amino acids 378 to 928 of retinoblastoma)
Residue:
928