Target
Phenylalanine--tRNA ligase alpha/beta subunit
Ligand
BDBM231672
Substrate
Meas. Tech.
Aminoacylation Assay
pH
8±n/a
IC50
1.0e+3±n/a nM
Comments
extracted
Citation
 Abibi, AFerguson, ADFleming, PRGao, NHajec, LIHu, JLaganas, VAMcKinney, DCMcLeod, SMPrince, DBShapiro, ABBuurman, ET The role of a novel auxiliary pocket in bacterial phenylalanyl-tRNA synthetase druggability. J Biol Chem 289:21651-62 (2014)  
Target
Name:
Phenylalanine--tRNA ligase alpha/beta subunit
Synonyms:
Phenylalanyl-tRNA synthetase (PheRS)
Type:
Enzyme
Mol. Mass.:
Description:
E. coli PheRS
Components:
This complex has 2 components.
Component 1
Name:
Phenylalanine--tRNA ligase alpha subunit
Synonyms:
Phenylalanyl-tRNA synthetase alpha subunit (PheRS) pheS
Type:
Enzyme
Mol. Mass.:
36828.85
Organism:
Escherichia coli (Enterobacteria)
Description:
P08312
Residue:
327
  
Component 2
Name:
Phenylalanine--tRNA ligase beta subunit
Synonyms:
Phenylalanyl-tRNA synthetase beta subunit (PheRSβ) pheT
Type:
Enzyme
Mol. Mass.:
87356.43
Organism:
Escherichia coli (Enterobacteria)
Description:
P07395
Residue:
795
  
Inhibitor
Name:
BDBM231672
Synonyms:
Ethyl 2-(3-(3-(difluoromethyl)-1H-pyrazol-5-yl)phenoxy)acetate (3c)
Type:
Small organic molecule
Emp. Form.:
C14H14F2N2O3
Mol. Mass.:
296.2694
SMILES:
CCOC(=O)COc1cccc(c1)-c1cc(n[nH]1)C(F)F
: