Target
Tyrosine-protein kinase JAK2
Ligand
BDBM232599
Substrate
Meas. Tech.
JAK Enzyme Assay
pH
7.2±n/a
Temperature
295.15±n/a K
Ki
0.16±n/a nM
Comments
extracted
Citation
 Zak, MERay, NCGoodacre, SCMendonca, RKellar, TCheng, YLi, WYuen, P 5-chloro-2-difluoromethoxyphenyl pyrazolopyrimidine compounds, compositions and methods of use thereof US Patent  US9346815 Publication Date 5/24/2016 
Target
Name:
Tyrosine-protein kinase JAK2
Synonyms:
JAK-2 JAK2_HUMAN Janus kinase 2 (JAK2) | Janus kinase 2 (a protein tyrosine kinase)
Type:
Protein
Mol. Mass.:
130684.68
Organism:
Homo sapiens (Human)
Description:
O60674
Residue:
1132
  
Inhibitor
Name:
BDBM232599
Synonyms:
US9346815, 145 | US9604984, Example 145
Type:
Small organic molecule
Emp. Form.:
C32H32ClF2N9O3
Mol. Mass.:
664.105
SMILES:
Nc1nn2cccnc2c1C(=O)Nc1cn(nc1-c1cc(Cl)ccc1OC(F)F)C1CCN(CCCNC(=O)c2ccccc2)CC1
: