Target
Tyrosine-protein kinase JAK2
Ligand
BDBM232606
Substrate
Meas. Tech.
JAK Enzyme Assay
pH
7.2±n/a
Temperature
295.15±n/a K
Ki
0.19±n/a nM
Comments
extracted
Citation
 Zak, MERay, NCGoodacre, SCMendonca, RKellar, TCheng, YLi, WYuen, P 5-chloro-2-difluoromethoxyphenyl pyrazolopyrimidine compounds, compositions and methods of use thereof US Patent  US9346815 Publication Date 5/24/2016 
Target
Name:
Tyrosine-protein kinase JAK2
Synonyms:
JAK-2 JAK2_HUMAN Janus kinase 2 (JAK2) | Janus kinase 2 (a protein tyrosine kinase)
Type:
Protein
Mol. Mass.:
130684.68
Organism:
Homo sapiens (Human)
Description:
O60674
Residue:
1132
  
Inhibitor
Name:
BDBM232606
Synonyms:
US9346815, 152 | US9604984, Example 152
Type:
Small organic molecule
Emp. Form.:
C31H35ClF2N8O4
Mol. Mass.:
657.111
SMILES:
FC(F)Oc1ccc(Cl)cc1-c1nn(cc1NC(=O)c1cnn2cccnc12)C1CCN(CCCC(=O)NC2CCOCC2)CC1
: