Target
3-hydroxyacyl-CoA dehydrogenase type-2
Ligand
BDBM232926
Substrate
Meas. Tech.
ABAD Enzymatic Activity Assay
pH
7.3±n/a
Temperature
298.15±n/a K
Ki
2800±n/a nM
IC50
9900±n/a nM
Kd
256±n/a nM
Comments
extracted
Citation
 Yan, SValasani, KR Phosphonate derivatives and methods of use thereof in the treatment of Alzheimer's disease US Patent  US9346839 Publication Date 5/24/2016 
Target
Name:
3-hydroxyacyl-CoA dehydrogenase type-2
Synonyms:
Amyloid Binding Alcohol Dehydrogenase HADH2 HSD17B10 SCHAD XH98G2
Type:
Enyzme
Mol. Mass.:
26924.79
Organism:
Homo sapiens (Human)
Description:
Q99714
Residue:
261
  
Inhibitor
Name:
BDBM232926
Synonyms:
US9346839, 7 | US9738668, Compound 7
Type:
Small organic molecule
Emp. Form.:
C21H25N2O7PS
Mol. Mass.:
480.471
SMILES:
CCOP(=O)(OCC)[C@@H](Nc1nc2ccc(OC)cc2s1)c1ccc(O)c(c1)C(=O)OC
: